{"text_format":"1","workbook":"xlsx","n_sheets":21,"sheets":["Introduktion og hjælp","input","Ydervægge","Indervægge","Afløb","Altaner og altangange","Andet","Dæk","El- og mekaniske anlæg","Fundamenter","Søjler og bjælker","Udendørs areal","Tage","Terrændæk","Trapper og ramper","Vand","Varme","Ventilation og køl","Vinduer, døre, glasfacade","Sheet1","Ja_Nej"],"not_rendered":{"charts":0,"images":15,"macros":1,"external_links":0,"defined_names":38,"comments":0,"pivot_tables":0},"unopened":[],"bounds":{"document_bytes":16777216,"sheet_cells":100000,"rows_first":2000,"rows_last":500,"rows_between":2000,"halvings":0,"cell_chars":16384,"cell_head_chars":4096},"cells_cut":0,"cells_raw":0,"read":"whole","date_system":"1900"}

{"sheet":"Introduktion og hjælp","index":0,"n_rows":0,"n_cols":0,"rows_kept":0,"cut":false,"hidden":false,"merged":[[6,2,33,8],[7,12,10,19],[12,12,17,19]]}

{"sheet":"input","index":1,"n_rows":52,"n_cols":14,"rows_kept":52,"cut":false,"hidden":false,"merged":[[31,4,33,4],[34,4,36,4],[37,4,39,4],[40,4,42,4],[40,1,42,1],[40,2,42,2],[31,2,33,2],[34,1,36,1],[34,2,36,2],[37,1,39,1],[37,2,39,2],[31,1,33,1],[31,3,33,3],[34,3,36,3],[37,3,39,3],[40,3,42,3],[49,0,51,0],[49,1,51,1],[49,2,51,2],[49,3,51,3],[49,4,51,4],[49,5,51,5],[49,6,51,6],[43,0,45,0],[43,4,45,4],[43,2,45,2],[43,3,45,3],[43,1,45,1],[46,0,48,0],[46,1,48,1],[46,2,48,2],[46,3,48,3],[46,4,48,4],[46,5,48,5],[46,6,48,6],[16,6,18,6],[16,0,18,0],[16,1,18,1],[16,2,18,2],[16,3,18,3],[16,4,18,4],[16,5,18,5],[10,6,12,6],[13,6,15,6],[10,3,12,3],[13,3,15,3],[10,4,12,4],[13,4,15,4],[13,0,15,0],[13,1,15,1],[13,2,15,2],[13,5,15,5],[10,5,12,5],[10,2,12,2],[10,1,12,1],[10,0,12,0],[1,3,3,3],[1,4,3,4],[1,5,3,5],[1,6,3,6],[4,3,6,3],[7,3,9,3],[7,4,9,4],[4,4,6,4],[4,5,6,5],[4,6,6,6],[7,5,9,5],[7,6,9,6],[4,2,6,2],[1,0,3,0],[4,0,6,0],[1,1,3,1],[7,0,9,0],[1,2,3,2],[4,1,6,1],[7,1,9,1],[7,2,9,2],[25,0,27,0],[28,0,30,0],[31,0,33,0],[34,0,36,0],[37,0,39,0],[40,0,42,0],[19,3,21,3],[19,4,21,4],[22,3,24,3],[25,3,27,3],[28,3,30,3],[19,0,21,0],[19,1,21,1],[22,0,24,0],[22,1,24,1],[19,2,21,2],[22,2,24,2],[22,4,24,4],[25,4,27,4],[28,4,30,4],[25,1,27,1],[25,2,27,2],[28,1,30,1],[28,2,30,2],[34,5,36,5],[37,5,39,5],[40,5,42,5],[43,5,45,5],[19,5,21,5],[22,5,24,5],[25,5,27,5],[28,5,30,5],[19,6,21,6],[22,6,24,6],[25,6,27,6],[28,6,30,6],[31,6,33,6],[34,6,36,6],[37,6,39,6],[40,6,42,6],[43,6,45,6],[31,5,33,5]]}
["Bygningsdel hovedgruppe","Bygningsdel undergruppe","ID","Bygningsdel","ID","Medtages","Beskrivelse","Konstruktion","ID ","Mængde","Enhed","Lag","Medtages","Beskrivelse"]
["Afløb","-",{"$f":"LOOKUP(B2,Afløb!$A$3:$B$5)","v":"-"},"Giv din bygningsdel et navn her",{"$f":"LOWER(CONCATENATE(DEC2HEX(RANDBETWEEN(0,4294967295),8),\"-\",DEC2HEX(RANDBETWEEN(0,65535),4),\"-\",DEC2HEX(RANDBETWEEN(16384,20479),4),\"-\",DEC2HEX(RANDBETWEEN(32768,49151),4),\"-\",DEC2HEX(RANDBETWEEN(0,65535),4),DEC2HEX(RANDBETWEEN(0,4294967295),8)))","v":"88e87b30-95ee-43a4-b5dd-0a638c87d648"},"-",null,"-",{"$f":"IF(H2=\"\",\"\",VLOOKUP(H2,Andet!$A$8:$B$495,2,FALSE))","v":"-"},null,{"$f":"IF(H2=\"\",\"\",VLOOKUP(H2,Andet!$A$8:$C$495,3,FALSE))","v":"-"},{"$f":"IF(H2:H52=\"\",\"\",LOOKUP(H2:H52,Andet!$A$8:$A$495,Andet!$D$8:$D$495))","v":"-"},"-"]
[null,null,null,null,null,null,null,"-",{"$f":"IF(H3=\"\",\"\",VLOOKUP(H3,Andet!$A$8:$B$495,2,FALSE))","v":"-"},null,{"$f":"IF(H3=\"\",\"\",VLOOKUP(H3,Andet!$A$8:$C$495,3,FALSE))","v":"-"},"-","-"]
[null,null,null,null,null,null,null,"-",{"$f":"IF(H4=\"\",\"\",VLOOKUP(H4,Andet!$A$8:$B$495,2,FALSE))","v":"-"},null,{"$f":"IF(H4=\"\",\"\",VLOOKUP(H4,Andet!$A$8:$C$495,3,FALSE))","v":"-"},"-","-"]
["Altaner og altangange","-",{"$f":"LOOKUP(B5,'Altaner og altangange'!$A$3:$B$6)","v":"-"},"Giv din bygningsdel et navn her",{"$f":"LOWER(CONCATENATE(DEC2HEX(RANDBETWEEN(0,4294967295),8),\"-\",DEC2HEX(RANDBETWEEN(0,65535),4),\"-\",DEC2HEX(RANDBETWEEN(16384,20479),4),\"-\",DEC2HEX(RANDBETWEEN(32768,49151),4),\"-\",DEC2HEX(RANDBETWEEN(0,65535),4),DEC2HEX(RANDBETWEEN(0,4294967295),8)))","v":"9b63ca4c-07ea-4ae8-ac70-b2431b27815c"},"-",null,"-",{"$f":"IF(H5=\"\",\"\",VLOOKUP(H5,Andet!$A$8:$B$495,2,FALSE))","v":"-"},null,{"$f":"IF(H5=\"\",\"\",VLOOKUP(H5,Andet!$A$8:$C$495,3,FALSE))","v":"-"},"-","-"]
[null,null,null,null,null,null,null,"-",{"$f":"IF(H6=\"\",\"\",VLOOKUP(H6,Andet!$A$8:$B$495,2,FALSE))","v":"-"},null,{"$f":"IF(H6=\"\",\"\",VLOOKUP(H6,Andet!$A$8:$C$495,3,FALSE))","v":"-"},"-","-"]
[null,null,null,null,null,null,null,"-",{"$f":"IF(H7=\"\",\"\",VLOOKUP(H7,Andet!$A$8:$B$495,2,FALSE))","v":"-"},null,{"$f":"IF(H7=\"\",\"\",VLOOKUP(H7,Andet!$A$8:$C$495,3,FALSE))","v":"-"},"-","-"]
["Andet","-",{"$f":"LOOKUP(B8,Andet!$A$3:$B$4)","v":"-"},"Giv din bygningsdel et navn her",{"$f":"LOWER(CONCATENATE(DEC2HEX(RANDBETWEEN(0,4294967295),8),\"-\",DEC2HEX(RANDBETWEEN(0,65535),4),\"-\",DEC2HEX(RANDBETWEEN(16384,20479),4),\"-\",DEC2HEX(RANDBETWEEN(32768,49151),4),\"-\",DEC2HEX(RANDBETWEEN(0,65535),4),DEC2HEX(RANDBETWEEN(0,4294967295),8)))","v":"36469ceb-318a-4b9a-b1f3-12c7e96249b2"},"-",null,"-",{"$f":"IF(H8=\"\",\"\",VLOOKUP(H8,Andet!$A$8:$B$495,2,FALSE))","v":"-"},null,{"$f":"IF(H8=\"\",\"\",VLOOKUP(H8,Andet!$A$8:$C$495,3,FALSE))","v":"-"},"-","-"]
[null,null,null,null,null,null,null,"-",{"$f":"IF(H9=\"\",\"\",VLOOKUP(H9,Andet!$A$8:$B$495,2,FALSE))","v":"-"},null,{"$f":"IF(H9=\"\",\"\",VLOOKUP(H9,Andet!$A$8:$C$495,3,FALSE))","v":"-"},"-","-"]
[null,null,null,null,null,null,null,"-",{"$f":"IF(H10=\"\",\"\",VLOOKUP(H10,Andet!$A$8:$B$495,2,FALSE))","v":"-"},null,{"$f":"IF(H10=\"\",\"\",VLOOKUP(H10,Andet!$A$8:$C$495,3,FALSE))","v":"-"},"-","-"]
["Dæk","-",{"$f":"LOOKUP(B11,Dæk!$A$3:$B$5)","v":"-"},"Giv din bygningsdel et navn her",{"$f":"LOWER(CONCATENATE(DEC2HEX(RANDBETWEEN(0,4294967295),8),\"-\",DEC2HEX(RANDBETWEEN(0,65535),4),\"-\",DEC2HEX(RANDBETWEEN(16384,20479),4),\"-\",DEC2HEX(RANDBETWEEN(32768,49151),4),\"-\",DEC2HEX(RANDBETWEEN(0,65535),4),DEC2HEX(RANDBETWEEN(0,4294967295),8)))","v":"67dfbad7-4c1e-4582-9c0b-262e837bd507"},"-",null,"-",{"$f":"IF(H11=\"\",\"\",VLOOKUP(H11,Andet!$A$8:$B$495,2,FALSE))","v":"-"},null,{"$f":"IF(H11=\"\",\"\",VLOOKUP(H11,Andet!$A$8:$C$495,3,FALSE))","v":"-"},"-","-"]
[null,null,null,null,null,null,null,"-",{"$f":"IF(H12=\"\",\"\",VLOOKUP(H12,Andet!$A$8:$B$495,2,FALSE))","v":"-"},null,{"$f":"IF(H12=\"\",\"\",VLOOKUP(H12,Andet!$A$8:$C$495,3,FALSE))","v":"-"},"-","-"]
[null,null,null,null,null,null,null,"-",{"$f":"IF(H13=\"\",\"\",VLOOKUP(H13,Andet!$A$8:$B$495,2,FALSE))","v":"-"},null,{"$f":"IF(H13=\"\",\"\",VLOOKUP(H13,Andet!$A$8:$C$495,3,FALSE))","v":"-"},"-","-"]
["El- og mekaniske anlæg","-",{"$f":"_xlfn.IFS($B$14='El- og mekaniske anlæg'!$A$3,'El- og mekaniske anlæg'!$B$3,$B$14='El- og mekaniske anlæg'!$A$4,'El- og mekaniske anlæg'!$B$4,$B$14='El- og mekaniske anlæg'!$A$5,'El- og mekaniske anlæg'!$B$5,$B$14='El- og mekaniske anlæg'!$A$6,'El- og mekaniske anlæg'!$B$6,$B$14='El- og mekaniske anlæg'!$A$7,'El- og mekaniske anlæg'!$B$7,$B$14='El- og mekaniske anlæg'!$A$8,'El- og mekaniske anlæg'!$B$8)","v":"-"},"Giv din bygningsdel et navn her",{"$f":"LOWER(CONCATENATE(DEC2HEX(RANDBETWEEN(0,4294967295),8),\"-\",DEC2HEX(RANDBETWEEN(0,65535),4),\"-\",DEC2HEX(RANDBETWEEN(16384,20479),4),\"-\",DEC2HEX(RANDBETWEEN(32768,49151),4),\"-\",DEC2HEX(RANDBETWEEN(0,65535),4),DEC2HEX(RANDBETWEEN(0,4294967295),8)))","v":"adf7fad5-f68b-4036-a459-7653dfd76f5c"},"-",null,"-",{"$f":"IF(H14=\"\",\"\",VLOOKUP(H14,Andet!$A$8:$B$495,2,FALSE))","v":"-"},null,{"$f":"IF(H14=\"\",\"\",VLOOKUP(H14,Andet!$A$8:$C$495,3,FALSE))","v":"-"},"-","-"]
[null,null,null,null,null,null,null,"-",{"$f":"IF(H15=\"\",\"\",VLOOKUP(H15,Andet!$A$8:$B$495,2,FALSE))","v":"-"},null,{"$f":"IF(H15=\"\",\"\",VLOOKUP(H15,Andet!$A$8:$C$495,3,FALSE))","v":"-"},"-","-"]
{"$rows_left_out":38}
{"sheet":"Ydervægge","index":2,"n_rows":108,"n_cols":4,"rows_kept":108,"cut":false,"hidden":true,"merged":[]}
["element categories"]
["name","id"]
["-","-"]
["Ydervægge","10a52123-48d7-466a-9622-d463511a6df0"]
["Kælderydervægge","4421b3e3-9b5d-49e9-a654-253c5974db75"]
[]
["constructions"]
["name","id","unit","layer"]
["-","-","-","-"]
["Inderside, indvendig efterisolering, forsatsvæg, mineraluld","d415e186-8b8d-5554-9f5a-9b414006913e","M2",1]
["Inderside, indvending efterisolering, porebetonblokke","11c0532b-8b6a-5e24-9153-2106d210afed","M2",1]
["Midterdel, betonelement 120mm, EPS-isolering","cbb01464-af35-5576-9eae-ac637583709e","M2",2]
["Midterdel, betonelement 120mm, mineraluld","852bccbf-7481-5b14-b831-21b7120b7bda","M2",2]
["Midterdel, betonelement 150mm, EPS-isolering","050f8b03-df35-55a4-9e48-e0c5efdba7b6","M2",2]
["Midterdel, betonelement 150mm, mineraluld","6a653b7a-7c17-5bfe-a5f6-979686ab5a7d","M2",2]
{"$rows_left_out":94}
{"sheet":"Indervægge","index":3,"n_rows":140,"n_cols":4,"rows_kept":140,"cut":false,"hidden":true,"merged":[]}
["element categories"]
["name","id"]
["-","-"]
["Ikke_bærende_indervægge","a9ab6709-61e1-46c1-a2e8-df00bdd0bb91"]
["Bærende_indervægge","59ab59a5-2482-45ae-85f1-d0e39e640712"]
["Ikke_bærende_indervægge_i_kælderen","d401d419-f4f6-45b9-bb18-31658a9a223b"]
["Bærende_indervægge_i_kælderen","2f6f494e-5e60-450d-aa7e-4f5845af39dc"]
[]
["constructions"]
["name","id","unit","layer"]
["-","-","-","-"]
["Indvendig glasvæg","fa115502-6347-4977-ab62-c9a55de694a5","M2",1]
["Indvendig glasvæg (EI30)","e36b056e-c967-5cdd-8926-cb4a40ef1103","M2",2]
["Midterdel, lersten ubrændt, ikke-bærende","efc62d29-2fa4-566c-8edd-0923ac054c26","M2",2]
["Midterdel, stål-sandxich-panel, 200 mm","d0e20f83-0ebb-5638-9c54-fd1724c698c5","M2",2]
{"$rows_left_out":126}
{"sheet":"Afløb","index":4,"n_rows":17,"n_cols":4,"rows_kept":17,"cut":false,"hidden":true,"merged":[]}
["element categories"]
["name","id"]
["-","-"]
["Faldstammer","4f07b17d-254b-4914-bac6-871c424016b8"]
["Nedløb_fra_tag","5fedd254-0ea3-46fc-99db-89d791b7ead1"]
[]
["constructions"]
["name","id","unit","layer"]
["-","-","-","-"]
["Nedløbsrør, inde","814f444a-128d-5621-a5f4-72554f0fa10f","M",1]
["Afløb, Enfamiliehus (Standardværdi)","388821b4-4bcc-4014-b0d1-6c22fa204f6f","M2",1]
["Afløb, Rækkehus (Standardværdi)","b46ed768-5825-4e93-9640-cffb36c24b2f","M2",1]
["Afløb, Etagebolig (Standardværdi)","b1601c7b-098a-4843-8dfb-0db4b84d039a","M2",1]
["Afløb, Kontor, Skoler og Daginstitutioner (Standardværdi)","b36df4b8-ce14-4721-887d-0c91bf907664","M2",1]
["Afløb, Øvrige bygninger (Standardværdi)","1d623adc-d131-4138-8320-5f0e728cc899","M2",1]
{"$rows_left_out":3}
{"sheet":"Altaner og altangange","index":5,"n_rows":31,"n_cols":4,"rows_kept":31,"cut":false,"hidden":true,"merged":[]}
["element categories"]
["name","id"]
["-","-"]
["Altanbund","a48092d1-8b5c-4fa9-9ada-69cec3fd1dca"]
["Rækværk","bdbec7c1-4744-43f8-9d06-84cf75288110"]
["Fastgørelse","98b7d6c8-6ece-4597-af57-faec8d963ca8"]
[]
["constructions"]
["Name","id","unit","layer"]
["-","-","-","-"]
["Altangang, beton","f331ba5f-1002-452e-8020-d5bffbde85cb","Pcs",1]
["Altangang, stål","2f628d53-c4c7-4136-8b25-60f0a6e970f2","Pcs",1]
["Bund, aluminiumsbund med gulv i træ","413bf3b5-717c-598a-bc69-d44ce921d8ce","M2",1]
["Bund, betonbund, armeret","fd36cdbd-0938-55b7-be29-4c078906e8a2","M2",1]
["Bund, stålramme med gulv i aluminiumsplade","60f47516-3f6d-5f50-94fb-f10acb5bac10","M2",1]
{"$rows_left_out":17}
{"sheet":"Andet","index":6,"n_rows":495,"n_cols":4,"rows_kept":495,"cut":false,"hidden":true,"merged":[]}
["element categories"]
["name","id"]
["-","-"]
["Andet","069983d0-d08b-405b-b816-d28ca9648956"]
[]
["constructions"]
["name","id","unit","layer"]
["-","-","-","-"]
["Afløb, Enfamiliehus (Standardværdi)","388821b4-4bcc-4014-b0d1-6c22fa204f6f","M2",1]
["Afløb, Etagebolig (Standardværdi)","b1601c7b-098a-4843-8dfb-0db4b84d039a","M2",1]
["Afløb, Kontor, Skoler og Daginstitutioner (Standardværdi)","b36df4b8-ce14-4721-887d-0c91bf907664","M2",1]
["Afløb, Rækkehus (Standardværdi)","b46ed768-5825-4e93-9640-cffb36c24b2f","M2",1]
["Afløb, Øvrige bygninger (Standardværdi)","1d623adc-d131-4138-8320-5f0e728cc899","M2",1]
["Altangang, beton","f331ba5f-1002-452e-8020-d5bffbde85cb","M2",1]
["Altangang, stål","2f628d53-c4c7-4136-8b25-60f0a6e970f2","M2",1]
{"$rows_left_out":481}
{"sheet":"Dæk","index":7,"n_rows":72,"n_cols":4,"rows_kept":72,"cut":false,"hidden":true,"merged":[]}
["element categories"]
["name","id"]
["-","-"]
["Etagedæk","f4c234ec-77f1-4ee0-92d0-f1819e0307d4"]
["Kælderdæk","f49cfb86-3081-48da-8a92-cba5022de4c1"]
[]
[]
["constructions"]
["name","id","unit","layer"]
["-","-","-","-"]
["Dæk, betonelement, forspændt huldæk 0,18/7,0 m","4b150038-75ad-5308-9b8a-71d36c8b0f21","M2",2]
["Dæk, betonelement, forspændt huldæk 0,22/12,0 m","1a865038-f98e-426c-b714-56147ff63ff8","M2",2]
["Dæk, betonelement, forspændt huldæk 0,22/7,0 m","0680fd0f-06dd-4e8a-8754-06e2183edfbd","M2",2]
["Dæk, betonelement, forspændt huldæk 0,27/12,0 m","5cb0aa64-8c45-4866-8de9-5a66e26a13bf","M2",2]
["Dæk, betonelement, forspændt huldæk 0,27/7,0 m","73d92f99-e606-4651-86c6-4e37e2bfdfb6","M2",2]
{"$rows_left_out":58}
{"sheet":"El- og mekaniske anlæg","index":8,"n_rows":14,"n_cols":4,"rows_kept":14,"cut":false,"hidden":true,"merged":[]}
["element categories"]
["name","id"]
["-","-"]
["El-anlæg","205798f2-16d0-4719-89fc-c6d6cf274375"]
["Belysning","8cbf3a89-57c8-4725-b3c3-481c1d6ce19d"]
["Transportanlæg","858395b4-2734-485e-ab34-c3129c7d24e7"]
["Energiproduktion","dc4a81ce-2d10-4fba-b282-a3cce4e9a187"]
["Andet (El- og mekaniske anlæg)","97145af4-423d-447f-a76e-b26feba645cd"]
[]
["constructions"]
["name","id","unit","layer"]
["-","-","-","-"]
["Solceller","5bdcfa0d-58f9-4904-9519-1b51ae87db68","M2",1]
["Solcelleanlæg 1000 kWh / m2*a","70a564ed-65bc-48fd-9455-5ae413f7db2b","M2",1]

{"sheet":"Fundamenter","index":9,"n_rows":33,"n_cols":4,"rows_kept":33,"cut":false,"hidden":true,"merged":[]}
["element categories"]
["name","id"]
["-","-"]
["Randfundamenter","1a966c7c-fd7c-4abc-9d4b-307fdcd0cc88"]
["Stribefundamenter_under_bærende_indervægge","846a848b-fa1a-43c8-85ed-8f2294c06ca5"]
["Punktfundament","e5f1c0f4-431e-4722-919f-35b15793f061"]
["Pælefundering","270e865a-07e6-4dbd-b4ff-a5e90edeba60"]
[]
["constructions"]
["name","id","unit","layer"]
["-","-","-","-"]
["Linjefundament under fritstående væg, frostfri 920/350 mm (h/b), letklinkerblokke","2b7d49a9-db00-4a24-b9e6-844d5cdb8718","M",1]
["Linjefundament under fritstående væg, frostfri 970/100 mm (h/b), letklinkerblokke","08c1f80d-d4cd-40f8-a2cb-d3beb7a4ae03","M",1]
["Linjefundament, 900/400 mm (h/b), 3-5 etager","09e7508f-7250-5946-b253-2b50ea755df9","M",1]
["Linjefundament, frostfri 1050/390 mm (h/b), skawblokke","48d33981-0406-4003-949b-62e7853f898d","M",1]
{"$rows_left_out":19}
{"sheet":"Søjler og bjælker","index":10,"n_rows":193,"n_cols":4,"rows_kept":193,"cut":false,"hidden":true,"merged":[]}
["element categories"]
["name","id"]
["-","-"]
["Søjler","506a420e-c3cd-4849-a759-3117f10937b1"]
["Bjælker","ec9ee040-9c1d-4cae-864c-4c6a0e4b8c5b"]
["Beklædning","0bea536d-2284-4728-80c8-2e01119c4cc7"]
["Andet (søjler og bjælker)","041605d6-5971-4ef5-8861-a8bb299082a7"]
[]
["constructions"]
["name","id","unit","layer"]
["-","-","-","-"]
["Bjælker/søjler, stål HEA 100","4355ad71-0dd0-58a3-b155-ca1954be5c98","M",1]
["Bjælker/søjler, stål HEA 120","47cd4308-d24d-52e8-be24-617e2efc18c3","M",1]
["Bjælker/søjler, stål HEA 140","a7aa9301-3c7d-56af-8c3a-e624e4430444","M",1]
["Bjælker/søjler, stål HEA 160","de84d35f-8387-54d3-96be-4b755d90f971","M",1]
{"$rows_left_out":179}
{"sheet":"Udendørs areal","index":11,"n_rows":458,"n_cols":4,"rows_kept":458,"cut":false,"hidden":true,"merged":[]}
["element categories"]
["name","id"]
["-","-"]
["Sekundær bebyggelse","670dd86e-1a08-4ef9-900e-1953dd4c1c3c"]
["Belægninger","14bdd9bc-fc11-4846-b89d-5434dd04b773"]
["Terrænbefæstninger ","0cec4daa-43c6-402a-89ef-4bd3a4b25312"]
["Udendørs belysning","c995ac63-9c84-4f58-82d5-5fe7ffd3da89"]
["Installationer over jord","02bccdda-7818-4c24-b028-5bfebaff4413"]
["Installationer under jord","d4beed46-bf57-49c7-a57f-a9bdf42484a5"]
["Udendørs inventar","87252bfb-b1f4-460f-b2c3-82cac8f79450"]
["Udendørs trapper og ramper","801b6a1a-982a-4e64-b6ac-faee4055a1d0"]
["Andet (udendørs areal)","4b058227-654f-426f-96ad-44caaf9cdf1b"]
[]
["constructions"]
["name","id","unit","layer"]
{"$rows_left_out":444}
{"sheet":"Tage","index":12,"n_rows":79,"n_cols":4,"rows_kept":79,"cut":false,"hidden":true,"merged":[]}
["element categories"]
["name","id"]
["-","-"]
["Tage","d734712a-d27d-42c5-936f-98fe4c4df90b"]
[]
["constructions"]
["name","id","unit","layer"]
["-","-","-","-"]
["Dæk, betonelement, forspændt huldæk 0,18/7,0 m","4b150038-75ad-5308-9b8a-71d36c8b0f21","M2",2]
["Dæk, betonelement, forspændt huldæk 0,32/12,0 m","a4df4ba5-fc25-57c0-ba0a-07998034cc06","M2",2]
["Dæk, betonelement, letbeton 0,16/5,0 m","1c1ac803-0323-5875-b81e-63286831937d","M2",2]
["Dæk, betonelement, letbeton 0,2/7,0 m","6b015df5-9096-593a-8c00-071c95aa24bc","M2",2]
["Dæk, betonelement, letbeton 0,24/7,0 m","766cd342-ff2f-51a0-9918-44043c575dd1","M2",2]
["Dæk, massivtræs- /betonelement 0,28/7,0 m, etagedæk","ae42f234-f459-5e23-9140-6c29bf565ecd","M2",2]
["Dæk, pladsstøbt 0,2/5,0 m","0422a883-5249-568d-a46a-09256060fb37","M2",2]
{"$rows_left_out":65}
{"sheet":"Terrændæk","index":13,"n_rows":39,"n_cols":4,"rows_kept":39,"cut":false,"hidden":true,"merged":[]}
["element categories"]
["name","id"]
["-","-"]
["Terrændæk","2ffe16fd-f0c9-4d31-a31a-f96d58d3df95"]
[]
[]
[]
["constructions"]
["name","id","unit","layer"]
["-","-","-","-"]
["Gulv, trægulv på strøer","81f8cc96-b7b8-5f26-bec2-c4987f68749c","M2",1]
["Gulv, parket, limet","e147b20c-b07f-5884-ad72-2fe1703da780","M2",1]
["Gulv, beton slidlag","30a7d849-f4e3-5f97-9a61-27936710323a","M2",1]
["Gulv, parket, svømmende","c1f43e31-d3ea-567a-8c39-79239dc9395b","M2",1]
["Gulv, gulvtæppe","23066b32-22ba-5a24-ba30-d993cd7939ac","M2",1]
{"$rows_left_out":25}
{"sheet":"Trapper og ramper","index":14,"n_rows":14,"n_cols":4,"rows_kept":14,"cut":false,"hidden":true,"merged":[]}
["element categories"]
["name","id"]
["-","-"]
["Trapper_og_ramper","1caeddce-29e9-4067-b85b-36e8d103a4a0"]
[]
["constructions"]
["name","id","unit","layer"]
["-","-","-","-"]
["Udvendig trappe i stål, per etage","f32cb9ae-7940-45b9-a517-abbdb1871b68","STK",1]
["Trappe i træ, per etage","ac56acce-658e-4db2-8adc-41d6a3090beb","STK",1]
["Trappe i beton, per etage","1f104def-f365-4959-835c-6d4a355d6e4d","STK",1]
["Rækværk, aluminium","8ce0f6de-1531-5ab2-b457-b7cbdf6f97a1","M",3]
["Rækværk, glas og rustfrit stål","29d0b8ff-23df-51e1-a351-0f7297f751a3","M",3]
["Rækværk, stål","52f22a0f-dc27-5909-9d4e-f70b76849c3e","M",3]

{"sheet":"Vand","index":15,"n_rows":23,"n_cols":4,"rows_kept":23,"cut":false,"hidden":true,"merged":[]}
["element categories"]
["name","id"]
["-","-"]
["Varmtvandsbeholder","1f691457-9bc8-423c-a107-c0254aa15768"]
["Vandrør","16528722-ecc6-4a69-a269-35ba3e1205b2"]
[]
["constructions"]
["name","id","unit","layer"]
["-","-","-","-"]
["Varmtvandsbeholder 160 L, 1-familiehus","5537057b-0f48-5a7a-9f0f-4258902ea50a","Pcs",1]
["Varmtvandsbeholder 500 L, central, skoler institutioner, u. storkøkken el brusere","af748ffb-8dba-5f0a-bf61-3a21ed2e3d6d","Pcs",1]
["Varmtvandsbeholder 500 L, kontor, per 5-10 brusere el storkøkken, decentral","3e73f9d3-4b1a-5bdb-b9ff-64a8436738ef","Pcs",1]
["Varmtvandsbeholder, central, 50 L per badeværelse (stk.)","632dd301-2036-5161-bb0a-7937872051ca","Pcs",1]
["Varmtvandsbeholder, decentral, 110 L per badeværelse (stk.)","50dc5fee-a095-577e-b5df-b59d41716fc0","Pcs",1]
["Varmtvandsbeholder, gennemstrømningsvandvarmer 4 L, decentral, Kontor, til toiletkerne / tekøkken","d32f1ec6-699c-5445-b5be-0c76366a95f8","Pcs",1]
{"$rows_left_out":9}
{"sheet":"Varme","index":16,"n_rows":35,"n_cols":4,"rows_kept":35,"cut":false,"hidden":true,"merged":[]}
["element categories"]
["name","id"]
["-","-"]
["Varmeforsyningsanlæg","0fb0348e-2c54-40cb-a4c6-a9c1f2033b22"]
["Varmerør","895bc4b9-ac42-46c2-8b6b-52a031660614"]
["Radiatorer","aea37dbf-bc04-404c-af3e-7f12d7f626b2"]
["Gulvvarme","78d66965-b806-47d6-af5f-b278e737adaa"]
["Andet (varme) ","142f0239-b1df-4295-9c52-2f8a8274a211"]
[]
["constructions"]
["name","id","unit","layer"]
["-","-","-","-"]
["Fjernvarmeveksler 120-400 kW, kontor, skoler og institutioner og etageboliger","55020381-7128-52ef-bf76-4c1b88a0b719","Pcs",1]
["Fjernvarmeveksler 20-120 kW, kontor, skoler og institutioner og etageboliger","28421eee-4111-517d-b661-377328522a6f","Pcs",1]
["Fjernvarmeveksler <20 kW, enfamiliehus og småbyggeri","2a3d7fa4-c094-552b-83dc-9b81bed75ff8","Pcs",1]
{"$rows_left_out":21}
{"sheet":"Ventilation og køl","index":17,"n_rows":35,"n_cols":4,"rows_kept":35,"cut":false,"hidden":true,"merged":[]}
["element categories"]
["name","id"]
["-","-"]
["Ventilationsanlæg","cf702d99-5d5a-4973-ba9c-c4dbfae656a9"]
["Ventilationskanaler","58015317-c3ee-41d3-a9df-5fbea8fb2dd2"]
[]
["constructions"]
["name","id","unit","layer"]
["-","-","-","-"]
["Ventilationsagregat 10.000 m3/h til kontor","f581ad41-d661-5564-bd03-38c64b14431a","Pcs",1]
["Ventilationsagregat 120 m3/h, etageboliger, decentral (per lejlighed)","d1022bad-bb87-5906-b0af-eed44e15ada5","Pcs",1]
["Ventilationsagregat 150 m3/h, enfamiliehus","d76ae856-66df-52f1-881d-8cd21dbd40dc","Pcs",1]
["Ventilationsagregat 20.000 m3/h med Køleanlæg, kontor, skoler og institutioner","dba379aa-0dee-546b-a39a-3977d68d7987","Pcs",1]
["Ventilationsagregat 20.000 m3/h, kontor, skoler og institutioner og centralt anlæg for etageboliger","d0ae3e88-c0a4-588d-968e-d2cdfd36a7af","Pcs",1]
["Varme, Ventilation og Køl, Enfamiliehus (Standardværdi)","9eee63cf-af22-43cc-ab92-2ec789fe7ed5","M2",1]
{"$rows_left_out":21}
{"sheet":"Vinduer, døre, glasfacade","index":18,"n_rows":52,"n_cols":4,"rows_kept":52,"cut":false,"hidden":true,"merged":[]}
["element categories"]
["name","id"]
["-","-"]
["Vinduer","dcbf55db-3189-4d22-9b2b-2e27c057b363"]
["Døre","9bd14e05-5fba-4ecb-ab41-7940a8a0dbdc"]
["Glasfacader","caa0d6a5-228f-44cb-9766-04056b28a825"]
[]
["constructions"]
["name","id","unit","layer"]
["-","-","-","-"]
["Fladtagsvindue, plast (komplet vindue)","f7a91b6c-e002-5401-9f3b-58964ac2d763","M2",1]
["Glastag, aluminium (komplet vindue)","f747e1e1-d5b1-5f0f-b2aa-e21f015660c9","M2",1]
["Karm, vinduer, aluminium","0a9ebeaf-48ff-50b2-b6c8-97bf39b456d2","M2",1]
["Karm, vinduer, plast","a2d31892-2115-527d-b1a0-5a55a1688efd","M2",1]
["Karm, vinduer, træ","bd9cee0d-d881-5253-a94f-78f1c403c091","M2",1]
{"$rows_left_out":38}
{"sheet":"Sheet1","index":19,"n_rows":0,"n_cols":0,"rows_kept":0,"cut":false,"hidden":true,"merged":[]}

{"sheet":"Ja_Nej","index":20,"n_rows":3,"n_cols":1,"rows_kept":3,"cut":false,"hidden":true,"merged":[]}
["-"]
["Ja"]
["Nej"]